{"text_format":"1","workbook":"xlsx","n_sheets":9,"sheets":["Data","Graph Ref","Introduction","Summary","Detailed Results","Data Graphs","Trends","Definitions","Print Full Report"],"not_rendered":{"charts":3,"images":4,"macros":1,"external_links":0,"defined_names":7,"comments":0,"pivot_tables":0},"unopened":[],"bounds":{"document_bytes":16777216,"sheet_cells":100000,"rows_first":2000,"rows_last":500,"rows_between":2000,"halvings":0,"cell_chars":16384,"cell_head_chars":4096},"cells_cut":0,"cells_raw":0,"read":"whole","date_system":"1900"}

{"sheet":"Data","index":0,"n_rows":145,"n_cols":44,"rows_kept":145,"cut":false,"hidden":true,"merged":[]}
[null,null,"Typical DHI Distributor","High Profit DHI Distributor","Sales Under $15 Million","Sales $15-$30 Million","Sales Over $30 Million","Sales Over $30 Million","Major Urban Markets","Secondary & Rural Markets","Rural Market Areas","Northeastern","Southeastern Region","North Central Region","Western","Canada","Under 70% Contract Jobs","70% - 80% Contract Jobs","Over 80% Contract Jobs","Lower Quartile","Upper Quartile",{"$f":"IF($W$1=0,\"\",\"\")","v":""},0,null,null,null,null,null,2014,2016,2017,2018,2019,2020,null,null,null,1234,"Your Company","Your Company","Your Company","N/A",2016,2017]
[null,"General"]
[null,"Number of Firms Reporting ",31,8,12,11,8,"N/A",12,15,"N/A","N/A",7,15,5,4,10,9,12,"","",null,null,null,null,null,null,null,42,45,38,34,25,{"$f":"C3","v":31}]
[null,"Typical Sales Volume",23.2,26.4,9.9,24.5,61.4,"N/A",16.8,23,"N/A","N/A",27.5,21,12.6,77.7,39,21,21.7,10.3,30.2,null,null,null,null,null,null,null,16.3,19.600000000000001,18.7,16.600000000000001,23.6,{"$f":"C4","v":23.2},null,null,null,null,24.5,24.5,25,"N/A"]
[null,"Sales Growth",-5.3999999999999999E-2,1.2999999999999999E-2,-9.1999999999999998E-2,-6.5000000000000002E-2,1.2999999999999999E-2,"N/A",-7.2999999999999995E-2,-2.4E-2,"N/A","N/A",-6.5000000000000002E-2,-7.3999999999999996E-2,4.4999999999999998E-2,1.4E-2,1.2999999999999999E-2,-0.11,-4.8000000000000001E-2,-0.114,4.4999999999999998E-2,null,null,null,null,null,null,null,3.6999999999999998E-2,4.9000000000000002E-2,5.7000000000000002E-2,0.124,5.8000000000000003E-2,{"$f":"C5","v":-5.3999999999999999E-2},null,null,null,null,4.0000000000000001E-3,4.0000000000000001E-3,0.02,"Secondary"]
[null,"Contract Sales Revenue",0.75,0.74,0.75,0.8,0.64200000000000002,"N/A",0.80500000000000005,0.75,"N/A","N/A",0.84,0.72,0.95,0.64400000000000002,0.66,0.75,0.93,0.68500000000000005,0.84,null,null,null,null,null,null,null,0.67,0.68,0.70499999999999996,0.72499999999999998,0.7,{"$f":"C6","v":0.75},null,null,null,null,0.35,0.35,0.35]
[null,"Sales by Product Category"]
[null,"Builders Hardware",0.42099999999999999,0.374,0.44800000000000001,0.44500000000000001,0.34799999999999998,"N/A",0.433,0.41799999999999998,"N/A","N/A",0.36299999999999999,0.45800000000000002,0.40799999999999997,0.39900000000000002,0.40200000000000002,0.50700000000000001,0.373,0.35,0.48599999999999999,null,null,null,null,null,null,null,0.44800000000000001,0.45100000000000001,0.44500000000000001,0.435,0.438,{"$f":"C8","v":0.42099999999999999},null,null,null,null,1.4E-2,1.4E-2,3.4000000000000002E-2]
[null,"Electronic Hardware",6.4,9.5,5.9,7.2,5.9,"N/A",6.4,7,"N/A","N/A",10.6,5.2,6.6,4.3,4.9000000000000004,4.8,9,2,10,null,null,null,null,null,null,null,4.8,6.2,6.7,6.3,5.4,6.4,null,null,null,null,2.6,2.6,2.7]
[null,"Metal Doors & Related Products",20.7,23.5,21,22.7,17.600000000000001,"N/A",20.2,21.4,"N/A","N/A",20.399999999999999,20.8,21.8,19.8,20.6,19.600000000000001,21.7,18,25,null,null,null,null,null,null,null,21.4,20,19.8,19.5,19.399999999999999,20.7,null,null,null,null,3.5999999999999997E-2,3.5999999999999997E-2,9.1999999999999998E-2]
[null,"Wood Doors & Frames",17.7,18.100000000000001,19.5,16.600000000000001,16.8,"N/A",21.9,16.399999999999999,"N/A","N/A",17.399999999999999,18.7,21.4,10.199999999999999,16.8,14.7,20.8,13.5,20,null,null,null,null,null,null,null,16.2,16.3,15.6,17.100000000000001,16.8,17.7,null,null,null,null,1.8,1.8,1.8]
[null,"Toilet Accessories & Partitions",4.9000000000000004,4.5,4.7,2.6,8,"N/A",1.9,5.9,"N/A","N/A",3.6,4.2,4.8,9.4,6.7,3.8,4.0999999999999996,0.9,7.3,null,null,null,null,null,null,null,3.3,4.4000000000000004,3.8,3.2,4.5,4.9000000000000004,null,null,null,null,6.5000000000000002E-2,6.5000000000000002E-2,0.16600000000000001]
[null,"All Other Products",8.1999999999999993,7,4.0999999999999996,6.4,16.899999999999999,{"$error":"#VALUE!"},6.3,7.5,{"$error":"#VALUE!"},{"$error":"#VALUE!"},11.7,5.3,4.5999999999999996,16.399999999999999,10.8,6.4,7.1,0,15,null,null,null,null,null,null,null,9.5,8,9.6,10.4,10.1,8.1999999999999993]
[null,"Total Sales",1,1,1,1,1,1,1,1,1,1,1,1,1,1,1,1,1,"","",null,null,null,null,null,null,null,1,1,1,1,1,1,null,null,null,null,1,1,1,24500000,24500000,25000000]
[null,"STRATEGIC PROFIT MODEL RATIOS",null,null,null,null,null,null,null,null,null,null,null,null,null,null,null,null,null,null,null,null,null,null,null,null,null,null,null,null,null,null,null,null,null,null,null,null,72.2,72.2,70.8,17700000,17700000,17700000]
{"$rows_left_out":131}
{"sheet":"Graph Ref","index":1,"n_rows":66,"n_cols":22,"rows_kept":66,"cut":false,"hidden":true,"merged":[]}
[" FPR Data",{"$f":"Data!C1","v":"Typical DHI Distributor"},{"$f":"Data!D1","v":"High Profit DHI Distributor"},{"$f":"Data!E1","v":"Sales Under $15 Million"},{"$f":"Data!F1","v":"Sales $15-$30 Million"},{"$f":"Data!G1","v":"Sales Over $30 Million"},{"$f":"Data!H1","v":"Sales Over $30 Million"},{"$f":"Data!I1","v":"Major Urban Markets"},{"$f":"Data!J1","v":"Secondary & Rural Markets"},{"$f":"Data!K1","v":"Rural Market Areas"},{"$f":"Data!L1","v":"Northeastern"},{"$f":"Data!M1","v":"Southeastern Region"},{"$f":"Data!N1","v":"North Central Region"},{"$f":"Data!O1","v":"Western"},{"$f":"Data!P1","v":"Canada"},{"$f":"Data!Q1","v":"Under 70% Contract Jobs"},{"$f":"Data!R1","v":"70% - 80% Contract Jobs"},{"$f":"Data!S1","v":"Over 80% Contract Jobs"},{"$f":"Data!T1","v":"Lower Quartile"},{"$f":"Data!U1","v":"Upper Quartile"},null,{"$f":"#REF!","v":{"$error":"#REF!"}}]
["RATIOS"]
["Sales Growth (%)",{"$f":"IFERROR(Data!C5*100,\"B\")","v":-5.4},{"$f":"IFERROR(Data!D5*100,\"B\")","v":1.3},{"$f":"IFERROR(Data!E5*100,\"B\")","v":-9.1999999999999993},{"$f":"IFERROR(Data!F5*100,\"B\")","v":-6.5},{"$f":"IFERROR(Data!G5*100,\"B\")","v":1.3},{"$f":"IFERROR(Data!H5*100,\"B\")","v":"B"},{"$f":"IFERROR(Data!I5*100,\"B\")","v":-7.3},{"$f":"IFERROR(Data!J5*100,\"B\")","v":-2.4},{"$f":"IFERROR(Data!K5*100,\"B\")","v":"B"},{"$f":"IFERROR(Data!L5*100,\"B\")","v":"B"},{"$f":"IFERROR(Data!M5*100,\"B\")","v":-6.5},{"$f":"IFERROR(Data!N5*100,\"B\")","v":-7.3999999999999995},{"$f":"IFERROR(Data!O5*100,\"B\")","v":4.5},{"$f":"IFERROR(Data!P5*100,\"B\")","v":1.4000000000000001},{"$f":"IFERROR(Data!Q5*100,\"B\")","v":1.3},{"$f":"IFERROR(Data!R5*100,\"B\")","v":-11},{"$f":"IFERROR(Data!S5*100,\"B\")","v":-4.8},{"$f":"IFERROR(Data!T5*100,\"B\")","v":-11.4},{"$f":"IFERROR(Data!U5*100,\"B\")","v":4.5},null,{"$f":"IFERROR(#REF!*100,\"B\")","v":"B"}]
["Profit Margin (%)",{"$f":"IFERROR(Data!C16*100,\"B\")","v":5},{"$f":"IFERROR(Data!D16*100,\"B\")","v":10.199999999999999},{"$f":"IFERROR(Data!E16*100,\"B\")","v":4.2},{"$f":"IFERROR(Data!F16*100,\"B\")","v":4},{"$f":"IFERROR(Data!G16*100,\"B\")","v":5.2},{"$f":"IFERROR(Data!H16*100,\"B\")","v":"B"},{"$f":"IFERROR(Data!I16*100,\"B\")","v":3.5999999999999996},{"$f":"IFERROR(Data!J16*100,\"B\")","v":5.0999999999999996},{"$f":"IFERROR(Data!K16*100,\"B\")","v":"B"},{"$f":"IFERROR(Data!L16*100,\"B\")","v":"B"},{"$f":"IFERROR(Data!M16*100,\"B\")","v":5},{"$f":"IFERROR(Data!N16*100,\"B\")","v":5.0999999999999996},{"$f":"IFERROR(Data!O16*100,\"B\")","v":1.4000000000000001},{"$f":"IFERROR(Data!P16*100,\"B\")","v":5.5},{"$f":"IFERROR(Data!Q16*100,\"B\")","v":5.5},{"$f":"IFERROR(Data!R16*100,\"B\")","v":4.8},{"$f":"IFERROR(Data!S16*100,\"B\")","v":3.8},{"$f":"IFERROR(Data!T16*100,\"B\")","v":1.4000000000000001},{"$f":"IFERROR(Data!U16*100,\"B\")","v":9.1},null,{"$f":"IFERROR(#REF!*100,\"B\")","v":"B"}]
["Asset Turnover",{"$f":"IFERROR(Data!C17,\"B\")","v":2.4},{"$f":"IFERROR(Data!D17,\"B\")","v":2.7},{"$f":"IFERROR(Data!E17,\"B\")","v":2.5},{"$f":"IFERROR(Data!F17,\"B\")","v":2.4},{"$f":"IFERROR(Data!G17,\"B\")","v":2.2000000000000002},{"$f":"IFERROR(Data!H17,\"B\")","v":"N/A"},{"$f":"IFERROR(Data!I17,\"B\")","v":2.6},{"$f":"IFERROR(Data!J17,\"B\")","v":2.2999999999999998},{"$f":"IFERROR(Data!K17,\"B\")","v":"N/A"},{"$f":"IFERROR(Data!L17,\"B\")","v":"N/A"},{"$f":"IFERROR(Data!M17,\"B\")","v":2.5},{"$f":"IFERROR(Data!N17,\"B\")","v":2.2999999999999998},{"$f":"IFERROR(Data!O17,\"B\")","v":2.4},{"$f":"IFERROR(Data!P17,\"B\")","v":2.5},{"$f":"IFERROR(Data!Q17,\"B\")","v":2.5},{"$f":"IFERROR(Data!R17,\"B\")","v":2.2999999999999998},{"$f":"IFERROR(Data!S17,\"B\")","v":2.4},{"$f":"IFERROR(Data!T17,\"B\")","v":1.9},{"$f":"IFERROR(Data!U17,\"B\")","v":2.8},null,{"$f":"IFERROR(#REF!,\"B\")","v":"B"}]
["Return On Assets (%)",{"$f":"IFERROR(Data!C18*100,\"B\")","v":12},{"$f":"IFERROR(Data!D18*100,\"B\")","v":27.500000000000004},{"$f":"IFERROR(Data!E18*100,\"B\")","v":10.5},{"$f":"IFERROR(Data!F18*100,\"B\")","v":9.6},{"$f":"IFERROR(Data!G18*100,\"B\")","v":11.4},{"$f":"IFERROR(Data!H18*100,\"B\")","v":"B"},{"$f":"IFERROR(Data!I18*100,\"B\")","v":9.4},{"$f":"IFERROR(Data!J18*100,\"B\")","v":11.700000000000001},{"$f":"IFERROR(Data!K18*100,\"B\")","v":"B"},{"$f":"IFERROR(Data!L18*100,\"B\")","v":"B"},{"$f":"IFERROR(Data!M18*100,\"B\")","v":12.5},{"$f":"IFERROR(Data!N18*100,\"B\")","v":11.700000000000001},{"$f":"IFERROR(Data!O18*100,\"B\")","v":3.4000000000000004},{"$f":"IFERROR(Data!P18*100,\"B\")","v":13.8},{"$f":"IFERROR(Data!Q18*100,\"B\")","v":13.8},{"$f":"IFERROR(Data!R18*100,\"B\")","v":11},{"$f":"IFERROR(Data!S18*100,\"B\")","v":9.1},{"$f":"IFERROR(Data!T18*100,\"B\")","v":3},{"$f":"IFERROR(Data!U18*100,\"B\")","v":22.5},null,{"$f":"IFERROR(#REF!*100,\"B\")","v":"B"}]
["Financial Leverage",{"$f":"IFERROR(Data!C19,\"B\")","v":1.4},{"$f":"IFERROR(Data!D19,\"B\")","v":1.3},{"$f":"IFERROR(Data!E19,\"B\")","v":1.7},{"$f":"IFERROR(Data!F19,\"B\")","v":1.3},{"$f":"IFERROR(Data!G19,\"B\")","v":2},{"$f":"IFERROR(Data!H19,\"B\")","v":"N/A"},{"$f":"IFERROR(Data!I19,\"B\")","v":1.6},{"$f":"IFERROR(Data!J19,\"B\")","v":1.3},{"$f":"IFERROR(Data!K19,\"B\")","v":"N/A"},{"$f":"IFERROR(Data!L19,\"B\")","v":"N/A"},{"$f":"IFERROR(Data!M19,\"B\")","v":1.2},{"$f":"IFERROR(Data!N19,\"B\")","v":1.6},{"$f":"IFERROR(Data!O19,\"B\")","v":1.3},{"$f":"IFERROR(Data!P19,\"B\")","v":1.8},{"$f":"IFERROR(Data!Q19,\"B\")","v":1.5},{"$f":"IFERROR(Data!R19,\"B\")","v":1.8},{"$f":"IFERROR(Data!S19,\"B\")","v":1.4},{"$f":"IFERROR(Data!T19,\"B\")","v":1.2},{"$f":"IFERROR(Data!U19,\"B\")","v":2.2999999999999998},null,{"$f":"IFERROR(#REF!,\"B\")","v":"B"}]
["Return On Net Worth (%)",{"$f":"IFERROR(Data!C20*100,\"B\")","v":16.8},{"$f":"IFERROR(Data!D20*100,\"B\")","v":35.799999999999997},{"$f":"IFERROR(Data!E20*100,\"B\")","v":17.899999999999999},{"$f":"IFERROR(Data!F20*100,\"B\")","v":12.5},{"$f":"IFERROR(Data!G20*100,\"B\")","v":22.8},{"$f":"IFERROR(Data!H20*100,\"B\")","v":"B"},{"$f":"IFERROR(Data!I20*100,\"B\")","v":15},{"$f":"IFERROR(Data!J20*100,\"B\")","v":15.2},{"$f":"IFERROR(Data!K20*100,\"B\")","v":"B"},{"$f":"IFERROR(Data!L20*100,\"B\")","v":"B"},{"$f":"IFERROR(Data!M20*100,\"B\")","v":15},{"$f":"IFERROR(Data!N20*100,\"B\")","v":18.7},{"$f":"IFERROR(Data!O20*100,\"B\")","v":4.3999999999999995},{"$f":"IFERROR(Data!P20*100,\"B\")","v":24.8},{"$f":"IFERROR(Data!Q20*100,\"B\")","v":20.7},{"$f":"IFERROR(Data!R20*100,\"B\")","v":19.8},{"$f":"IFERROR(Data!S20*100,\"B\")","v":12.7},{"$f":"IFERROR(Data!T20*100,\"B\")","v":5.6000000000000005},{"$f":"IFERROR(Data!U20*100,\"B\")","v":31},null,{"$f":"IFERROR(#REF!*100,\"B\")","v":"B"}]
["Current Ratio",{"$f":"IFERROR(Data!C71,\"B\")","v":3.3},{"$f":"IFERROR(Data!D71,\"B\")","v":4.4000000000000004},{"$f":"IFERROR(Data!E71,\"B\")","v":3.5},{"$f":"IFERROR(Data!F71,\"B\")","v":4.4000000000000004},{"$f":"IFERROR(Data!G71,\"B\")","v":2.5},{"$f":"IFERROR(Data!H71,\"B\")","v":"N/A"},{"$f":"IFERROR(Data!I71,\"B\")","v":3.7},{"$f":"IFERROR(Data!J71,\"B\")","v":3.7},{"$f":"IFERROR(Data!K71,\"B\")","v":"N/A"},{"$f":"IFERROR(Data!L71,\"B\")","v":"N/A"},{"$f":"IFERROR(Data!M71,\"B\")","v":4.8},{"$f":"IFERROR(Data!N71,\"B\")","v":2.5},{"$f":"IFERROR(Data!O71,\"B\")","v":7.2},{"$f":"IFERROR(Data!P71,\"B\")","v":2.2999999999999998},{"$f":"IFERROR(Data!Q71,\"B\")","v":3.3},{"$f":"IFERROR(Data!R71,\"B\")","v":1.8},{"$f":"IFERROR(Data!S71,\"B\")","v":4.4000000000000004},{"$f":"IFERROR(Data!T71,\"B\")","v":2.2000000000000002},{"$f":"IFERROR(Data!U71,\"B\")","v":5.7},null,{"$f":"IFERROR(#REF!,\"B\")","v":"B"}]
["Quick Ratio",{"$f":"IFERROR(Data!C72,\"B\")","v":2.6},{"$f":"IFERROR(Data!D72,\"B\")","v":3.6},{"$f":"IFERROR(Data!E72,\"B\")","v":2.8},{"$f":"IFERROR(Data!F72,\"B\")","v":3.6},{"$f":"IFERROR(Data!G72,\"B\")","v":1.4},{"$f":"IFERROR(Data!H72,\"B\")","v":"N/A"},{"$f":"IFERROR(Data!I72,\"B\")","v":3.1},{"$f":"IFERROR(Data!J72,\"B\")","v":2.8},{"$f":"IFERROR(Data!K72,\"B\")","v":"N/A"},{"$f":"IFERROR(Data!L72,\"B\")","v":"N/A"},{"$f":"IFERROR(Data!M72,\"B\")","v":4},{"$f":"IFERROR(Data!N72,\"B\")","v":2.1},{"$f":"IFERROR(Data!O72,\"B\")","v":6.3},{"$f":"IFERROR(Data!P72,\"B\")","v":1.4},{"$f":"IFERROR(Data!Q72,\"B\")","v":2},{"$f":"IFERROR(Data!R72,\"B\")","v":1.3},{"$f":"IFERROR(Data!S72,\"B\")","v":3.5},{"$f":"IFERROR(Data!T72,\"B\")","v":1.3},{"$f":"IFERROR(Data!U72,\"B\")","v":4.0999999999999996},null,{"$f":"IFERROR(#REF!,\"B\")","v":"B"}]
["Cash To Current Liabilities",{"$f":"IFERROR(Data!C73*100,\"B\")","v":64.5},{"$f":"IFERROR(Data!D73*100,\"B\")","v":74},{"$f":"IFERROR(Data!E73*100,\"B\")","v":65.400000000000006},{"$f":"IFERROR(Data!F73*100,\"B\")","v":100.4},{"$f":"IFERROR(Data!G73*100,\"B\")","v":3.9},{"$f":"IFERROR(Data!H73*100,\"B\")","v":"B"},{"$f":"IFERROR(Data!I73*100,\"B\")","v":69.3},{"$f":"IFERROR(Data!J73*100,\"B\")","v":40.9},{"$f":"IFERROR(Data!K73*100,\"B\")","v":"B"},{"$f":"IFERROR(Data!L73*100,\"B\")","v":"B"},{"$f":"IFERROR(Data!M73*100,\"B\")","v":94.8},{"$f":"IFERROR(Data!N73*100,\"B\")","v":10},{"$f":"IFERROR(Data!O73*100,\"B\")","v":241.5},{"$f":"IFERROR(Data!P73*100,\"B\")","v":"B"},{"$f":"IFERROR(Data!Q73*100,\"B\")","v":4.3999999999999995},{"$f":"IFERROR(Data!R73*100,\"B\")","v":4.5999999999999996},{"$f":"IFERROR(Data!S73*100,\"B\")","v":105.89999999999999},{"$f":"IFERROR(Data!T73*100,\"B\")","v":3.9},{"$f":"IFERROR(Data!U73*100,\"B\")","v":195.6},null,{"$f":"IFERROR(#REF!*100,\"B\")","v":"B"}]
["Average Collection Period (Days)",{"$f":"IFERROR(Data!C92,\"B\")","v":73.599999999999994},{"$f":"IFERROR(Data!D92,\"B\")","v":70.599999999999994},{"$f":"IFERROR(Data!E92,\"B\")","v":74.8},{"$f":"IFERROR(Data!F92,\"B\")","v":67.599999999999994},{"$f":"IFERROR(Data!G92,\"B\")","v":83.9},{"$f":"IFERROR(Data!H92,\"B\")","v":"N/A"},{"$f":"IFERROR(Data!I92,\"B\")","v":71.7},{"$f":"IFERROR(Data!J92,\"B\")","v":71.400000000000006},{"$f":"IFERROR(Data!K92,\"B\")","v":"N/A"},{"$f":"IFERROR(Data!L92,\"B\")","v":"N/A"},{"$f":"IFERROR(Data!M92,\"B\")","v":81},{"$f":"IFERROR(Data!N92,\"B\")","v":63.5},{"$f":"IFERROR(Data!O92,\"B\")","v":75.8},{"$f":"IFERROR(Data!P92,\"B\")","v":85},{"$f":"IFERROR(Data!Q92,\"B\")","v":66.8},{"$f":"IFERROR(Data!R92,\"B\")","v":81},{"$f":"IFERROR(Data!S92,\"B\")","v":72.599999999999994},{"$f":"IFERROR(Data!T92,\"B\")","v":61.1},{"$f":"IFERROR(Data!U92,\"B\")","v":84},null,{"$f":"IFERROR(#REF!,\"B\")","v":"B"}]
["Inventory Holding Period ",{"$f":"IFERROR(Data!C93,\"B\")","v":56.4},{"$f":"IFERROR(Data!D93,\"B\")","v":52.2},{"$f":"IFERROR(Data!E93,\"B\")","v":49.4},{"$f":"IFERROR(Data!F93,\"B\")","v":49.1},{"$f":"IFERROR(Data!G93,\"B\")","v":61},{"$f":"IFERROR(Data!H93,\"B\")","v":"N/A"},{"$f":"IFERROR(Data!I93,\"B\")","v":45.9},{"$f":"IFERROR(Data!J93,\"B\")","v":57.9},{"$f":"IFERROR(Data!K93,\"B\")","v":"N/A"},{"$f":"IFERROR(Data!L93,\"B\")","v":"N/A"},{"$f":"IFERROR(Data!M93,\"B\")","v":49.1},{"$f":"IFERROR(Data!N93,\"B\")","v":55.4},{"$f":"IFERROR(Data!O93,\"B\")","v":44.8},{"$f":"IFERROR(Data!P93,\"B\")","v":68.5},{"$f":"IFERROR(Data!Q93,\"B\")","v":71.900000000000006},{"$f":"IFERROR(Data!R93,\"B\")","v":49.1},{"$f":"IFERROR(Data!S93,\"B\")","v":37.4},{"$f":"IFERROR(Data!T93,\"B\")","v":30},{"$f":"IFERROR(Data!U93,\"B\")","v":68.7},null,{"$f":"IFERROR(#REF!,\"B\")","v":"B"}]
["Gross Cash Flow ",{"$f":"IFERROR(Data!C94,\"B\")","v":130},{"$f":"IFERROR(Data!D94,\"B\")","v":122.8},{"$f":"IFERROR(Data!E94,\"B\")","v":124.2},{"$f":"IFERROR(Data!F94,\"B\")","v":116.7},{"$f":"IFERROR(Data!G94,\"B\")","v":144.9},{"$f":"IFERROR(Data!H94,\"B\")","v":0},{"$f":"IFERROR(Data!I94,\"B\")","v":117.6},{"$f":"IFERROR(Data!J94,\"B\")","v":129.30000000000001},{"$f":"IFERROR(Data!K94,\"B\")","v":0},{"$f":"IFERROR(Data!L94,\"B\")","v":0},{"$f":"IFERROR(Data!M94,\"B\")","v":130.1},{"$f":"IFERROR(Data!N94,\"B\")","v":118.9},{"$f":"IFERROR(Data!O94,\"B\")","v":120.6},{"$f":"IFERROR(Data!P94,\"B\")","v":153.5},{"$f":"IFERROR(Data!Q94,\"B\")","v":138.69999999999999},{"$f":"IFERROR(Data!R94,\"B\")","v":130.1},{"$f":"IFERROR(Data!S94,\"B\")","v":110},{"$f":"IFERROR(Data!T94,\"B\")","v":91.1},{"$f":"IFERROR(Data!U94,\"B\")","v":152.69999999999999},null,{"$f":"IFERROR(#REF!,\"B\")","v":"B"}]
["A/P Payout Period",{"$f":"IFERROR(Data!C95,\"B\")","v":19.100000000000001},{"$f":"IFERROR(Data!D95,\"B\")","v":19.5},{"$f":"IFERROR(Data!E95,\"B\")","v":21.6},{"$f":"IFERROR(Data!F95,\"B\")","v":13.1},{"$f":"IFERROR(Data!G95,\"B\")","v":27.7},{"$f":"IFERROR(Data!H95,\"B\")","v":"N/A"},{"$f":"IFERROR(Data!I95,\"B\")","v":12.6},{"$f":"IFERROR(Data!J95,\"B\")","v":24.2},{"$f":"IFERROR(Data!K95,\"B\")","v":"N/A"},{"$f":"IFERROR(Data!L95,\"B\")","v":"N/A"},{"$f":"IFERROR(Data!M95,\"B\")","v":14},{"$f":"IFERROR(Data!N95,\"B\")","v":15.6},{"$f":"IFERROR(Data!O95,\"B\")","v":13.1},{"$f":"IFERROR(Data!P95,\"B\")","v":48.7},{"$f":"IFERROR(Data!Q95,\"B\")","v":19.899999999999999},{"$f":"IFERROR(Data!R95,\"B\")","v":28.3},{"$f":"IFERROR(Data!S95,\"B\")","v":16.100000000000001},{"$f":"IFERROR(Data!T95,\"B\")","v":11.1},{"$f":"IFERROR(Data!U95,\"B\")","v":34.9},null,{"$f":"IFERROR(#REF!,\"B\")","v":"B"}]
{"$rows_left_out":52}
{"sheet":"Introduction","index":2,"n_rows":65,"n_cols":10,"rows_kept":65,"cut":false,"hidden":false,"merged":[[18,8,18,10]]}
[]
[]
[]
[]
[]
[]
[]
[null,null,null,null,null,null,null,null,null,"2021 DHI Financial Benchmarking Report"]
[null,null,null,null,null,null,null,null,null,"Figures Based on 2020 Financial Data"]
[]
[]
[]
[]
[]
[]
{"$rows_left_out":51}
{"sheet":"Summary","index":3,"n_rows":88,"n_cols":14,"rows_kept":88,"cut":false,"hidden":false,"merged":[[94,7,95,7],[14,6,14,13],[15,8,18,8],[15,9,18,9],[15,10,18,10],[15,11,18,11],[15,13,18,13],[94,8,95,8],[94,9,95,9],[94,10,95,10],[94,11,95,11],[7,13,10,13],[92,6,92,13],[7,12,10,12],[15,12,18,12],[7,8,10,8],[7,9,10,9],[7,10,10,10],[7,11,10,11]]}
[]
[]
[]
[]
[]
[]
[]
[null,null,null,null,null,null,null,null,"Typical DHI Distributor","High Profit DHI Distributor","Under 70% Contract Jobs","70% - 80% Contract Jobs","Over 80% Contract Jobs","Your Company"]
[]
[]
[]
[]
[]
[]
[null,null,null,null,null,null,"Executive Summary"]
{"$rows_left_out":74}
{"sheet":"Detailed Results","index":4,"n_rows":178,"n_cols":13,"rows_kept":178,"cut":false,"hidden":false,"merged":[[128,12,130,12],[166,6,166,12],[167,12,169,12],[73,6,73,12],[74,12,76,12],[99,6,99,12],[100,12,102,12],[127,6,127,12],[46,6,46,12],[47,12,49,12],[7,12,10,12],[13,6,13,12],[14,12,16,12],[7,7,10,7],[7,8,10,8],[7,9,10,9],[7,10,10,10],[7,11,10,11]]}
[]
[]
[]
[]
[]
[]
[]
[null,null,null,null,null,null,null,"Typical DHI Distributor","High Profit DHI Distributor","Under 70% Contract Jobs","70% - 80% Contract Jobs","Over 80% Contract Jobs","Your Company"]
[]
[]
[]
[]
[]
[null,null,null,null,null,null,"Return On Investment / Product Mix"]
[null,null,null,null,null,null,null,null,null,null,null,null,{"$f":"M8","v":"Your Company"}]
{"$rows_left_out":164}
{"sheet":"Data Graphs","index":5,"n_rows":65,"n_cols":15,"rows_kept":65,"cut":false,"hidden":false,"merged":[[18,6,20,7],[41,6,43,7],[64,6,66,7],[7,13,10,13],[7,14,10,14],[7,9,10,9],[7,10,10,10],[7,11,10,11],[7,12,10,12]]}
[]
[]
[]
[]
[]
[]
[]
[null,null,null,null,null,null,null,null,null,"Typical DHI Distributor","High Profit DHI Distributor","Under 70% Contract Jobs","70% - 80% Contract Jobs","Over 80% Contract Jobs","Your Company"]
[]
[]
[]
[]
[]
[]
[]
{"$rows_left_out":51}
{"sheet":"Trends","index":6,"n_rows":127,"n_cols":12,"rows_kept":127,"cut":false,"hidden":false,"merged":[[199,11,199,12],[199,9,199,10],[201,9,201,10],[202,9,202,10],[207,11,207,12],[205,11,205,12],[204,11,204,12],[203,11,203,12],[202,11,202,12],[203,9,203,10],[204,9,204,10],[205,9,205,10],[207,9,207,10],[201,11,201,12],[178,9,178,10],[179,9,179,10],[181,9,181,10],[182,9,182,10],[184,9,184,10],[185,9,185,10],[186,9,186,10],[187,9,187,10],[188,9,188,10],[190,9,190,10],[175,9,175,10],[176,9,176,10],[177,9,177,10],[176,11,176,12],[174,11,174,12],[169,9,169,10],[170,9,170,10],[171,9,171,10],[172,9,172,10],[174,9,174,10],[161,9,161,10],[163,9,163,10],[164,9,164,10],[165,9,165,10],[168,9,168,10],[190,11,190,12],[188,11,188,12],[187,11,187,12],[186,11,186,12],[185,11,185,12],[161,11,161,12],[175,11,175,12],[163,11,163,12],[184,11,184,12],[182,11,182,12],[181,11,181,12],[179,11,179,12],[178,11,178,12],[177,11,177,12],[172,11,172,12],[171,11,171,12],[170,11,170,12],[169,11,169,12],[168,11,168,12],[165,11,165,12],[164,11,164,12]]}
[]
[]
[]
[]
[]
[]
[]
[]
[]
[]
[]
[]
[]
[null,null,null,null,null,null,"Trends: Return On Investment / Product Mix"]
[null,null,null,null,null,null,null,{"$f":"I15-1","v":2016},2017,2018,{"$f":"L15-1","v":2019},2020]
{"$rows_left_out":113}
{"sheet":"Definitions","index":7,"n_rows":504,"n_cols":15,"rows_kept":504,"cut":false,"hidden":false,"merged":[[20,10,21,10],[20,11,21,11],[20,12,21,12],[20,13,21,13],[20,14,21,14],[20,5,21,5],[20,6,21,6],[20,7,21,7],[20,8,21,8],[20,9,21,9],[20,0,21,0],[20,1,21,1],[20,2,21,2],[20,3,21,3],[20,4,21,4]]}
[]
[]
[]
[]
[]
[]
[]
[null,null,null,null,null,null,"Definitions: Return On Investment"]
[]
[null,null,null,null,null,null,"Return On Net Worth (RONW) and Return On Assets (ROA) are two of the most important measures"]
[null,null,null,null,null,null,"for evaluating how effectively a company’s management team is managing the capital that owners or"]
[null,null,null,null,null,null,"shareholders entrust to it."]
[]
[null,null,null,null,null,null,"Return On Net Worth is affected by three things: operating efficiency, which is measured by profit margin;"]
[null,null,null,null,null,null,"asset use efficiency, which is measured by total asset turnover; and financial leverage, which is measured"]
{"$rows_left_out":490}
{"sheet":"Print Full Report","index":8,"n_rows":818,"n_cols":28,"rows_kept":818,"cut":false,"hidden":false,"merged":[[799,2,799,4],[801,2,801,3],[801,4,802,4],[802,2,802,3],[789,2,789,4],[790,2,790,4],[792,2,792,4],[793,2,793,4],[795,2,795,3],[795,4,796,4],[796,2,796,3],[798,2,798,4],[817,2,817,4],[810,2,810,4],[811,2,811,4],[813,2,813,4],[814,2,814,4],[816,2,816,4],[804,2,804,3],[804,4,805,4],[805,2,805,3],[807,2,807,4],[808,2,808,4],[783,2,783,4],[784,2,784,4],[786,2,786,3],[780,4,781,4],[781,2,781,3],[786,4,787,4],[787,2,787,3],[777,2,777,4],[778,2,778,4],[780,2,780,3],[765,0,766,2],[765,3,766,5],[769,2,769,4],[771,2,771,4],[772,2,772,4],[774,2,774,4],[775,2,775,4],[765,6,766,9],[768,2,768,4],[395,0,396,0],[131,5,132,5],[131,6,132,6],[131,8,132,8],[131,0,132,0],[131,1,132,1],[131,2,132,2],[131,3,132,3],[131,4,132,4]]}
[]
[]
[]
[]
[]
[]
[]
[null,null,null,null,"2021 DHI Financial Benchmarking Report"]
[null,null,null,null,"Figures based on 2020 financial data"]
[]
[null,null,null,null,"Prepared by Mackay Research Group"]
[]
["Table Of Contents",null,null,null,null,null,null,null,"Page"]
[" Executive Summary",null,null,null,null,null,null,null,1]
[]
{"$rows_left_out":803}